Reaction Details
Target5-hydroxytryptamine receptor 3A
LigandBDBM82561
Substrate/Competitorn/a
Meas. Tech.ChEMBL_761947 (CHEMBL1817466)
Ki 3.9±n/a nM
Citation Dolusic, ELarrieu, PMoineaux, LStroobant, VPilotte, LColau, DPochet, LVan den Eynde, BMasereel, BWouters, JFrédérick, R Tryptophan 2,3-dioxygenase (TDO) inhibitors. 3-(2-(pyridyl)ethenyl)indoles as potential anticancer immunomodulators. J Med Chem54:5320-34 (2011) 
 
5-hydroxytryptamine receptor 3A
Name:5-hydroxytryptamine receptor 3A
Type:Protein
Mol. Mass.:55283.27
Organism:Homo sapiens (Human)
Description:P46098
Residue:478
BDBM82561
NameBDBM82561
Synonyms:CAS_40796-97-2 Tropanyl-3,5 dichlorobenzoate
TypeSmall organic molecule
Emp. Form.C15H17Cl2NO2
Mol. Mass.314.207
SMILESCN1[C@H]2CC[C@@H]1C[C@@H](C2)OC(=O)c1cc(Cl)cc(Cl)c1