Reaction Details
TargetSolute carrier family 15 member 2
LigandBDBM50169125
Substrate/Competitorn/a
Meas. Tech.ChEMBL_762551 (CHEMBL1817008)
Ki 23000±n/a nM
Citation Pedretti, ADe Luca, LMarconi, CRegazzoni, LAldini, GVistoli, G Fragmental modeling of hPepT2 and analysis of its binding features by docking studies and pharmacophore mapping. Bioorg Med Chem19:4544-51 (2011) 
 
Solute carrier family 15 member 2
Name:Solute carrier family 15 member 2
Type:PROTEIN
Mol. Mass.:81795.62
Organism:Homo sapiens (Human)
Description:ChEMBL_762551
Residue:729
BDBM50169125
NameBDBM50169125
Synonyms:(S)-6-Amino-2-((S)-2-amino-propionylamino)-hexanoic acid Ala-Lys | CHEMBL191057
TypeSmall organic molecule
Emp. Form.C9H19N3O3
Mol. Mass.217.2655
SMILESC[C@H](N)C(=O)N[C@@H](CCCCN)C(O)=O