Reaction Details
TargetSolute carrier family 15 member 2
LigandBDBM50350465
Substrate/Competitorn/a
Meas. Tech.ChEMBL_762551 (CHEMBL1817008)
Ki 1300000±n/a nM
Citation Pedretti, ADe Luca, LMarconi, CRegazzoni, LAldini, GVistoli, G Fragmental modeling of hPepT2 and analysis of its binding features by docking studies and pharmacophore mapping. Bioorg Med Chem19:4544-51 (2011) 
 
Solute carrier family 15 member 2
Name:Solute carrier family 15 member 2
Type:PROTEIN
Mol. Mass.:81795.62
Organism:Homo sapiens (Human)
Description:ChEMBL_762551
Residue:729
BDBM50350465
NameBDBM50350465
Synonyms:AMPICILLIN Amcill Ampicillin sulfate
TypeSmall organic molecule
Emp. Form.C16H19N3O4S
Mol. Mass.349.405
SMILESCC1(C)S[C@@H]2[C@H](NC(=O)[C@H](N)c3ccccc3)C(=O)N2[C@H]1C(O)=O