Reaction Details
TargetSolute carrier family 15 member 2
LigandBDBM50350477
Substrate/Competitorn/a
Meas. Tech.ChEMBL_762551 (CHEMBL1817008)
Ki 6000±n/a nM
Citation Pedretti, ADe Luca, LMarconi, CRegazzoni, LAldini, GVistoli, G Fragmental modeling of hPepT2 and analysis of its binding features by docking studies and pharmacophore mapping. Bioorg Med Chem19:4544-51 (2011) 
 
Solute carrier family 15 member 2
Name:Solute carrier family 15 member 2
Type:PROTEIN
Mol. Mass.:81795.62
Organism:Homo sapiens (Human)
Description:ChEMBL_762551
Residue:729
BDBM50350477
NameBDBM50350477
Synonyms:CHEMBL1814492
TypeSmall organic molecule
Emp. Form.C15H29N3O4S3
Mol. Mass.411.603
SMILESCSCC[C@@H](N)C(=O)N[C@@H](CCSC)C(=O)N[C@@H](CCSC)C(O)=O