Reaction Details
TargetSolute carrier family 15 member 2
LigandBDBM82191
Substrate/Competitorn/a
Meas. Tech.ChEMBL_762551 (CHEMBL1817008)
Ki 230000±n/a nM
Citation Pedretti, ADe Luca, LMarconi, CRegazzoni, LAldini, GVistoli, G Fragmental modeling of hPepT2 and analysis of its binding features by docking studies and pharmacophore mapping. Bioorg Med Chem19:4544-51 (2011) 
 
Solute carrier family 15 member 2
Name:Solute carrier family 15 member 2
Type:PROTEIN
Mol. Mass.:81795.62
Organism:Homo sapiens (Human)
Description:ChEMBL_762551
Residue:729
BDBM82191
NameBDBM82191
Synonyms:Substrate analogue, 8
TypeSmall organic molecule
Emp. Form.C5H8O3
Mol. Mass.116.1152
SMILESCC(=O)CCC(O)=O