Reaction Details
TargetSolute carrier family 15 member 2
LigandBDBM50169129
Substrate/Competitorn/a
Meas. Tech.ChEMBL_762551 (CHEMBL1817008)
Ki 4400±n/a nM
Citation Pedretti, ADe Luca, LMarconi, CRegazzoni, LAldini, GVistoli, G Fragmental modeling of hPepT2 and analysis of its binding features by docking studies and pharmacophore mapping. Bioorg Med Chem19:4544-51 (2011) 
 
Solute carrier family 15 member 2
Name:Solute carrier family 15 member 2
Type:PROTEIN
Mol. Mass.:81795.62
Organism:Homo sapiens (Human)
Description:ChEMBL_762551
Residue:729
BDBM50169129
NameBDBM50169129
Synonyms:(S)-2-[(S)-2-Amino-3-(4-hydroxy-phenyl)-propionylamino]-propionic acid Tyr-Ala
TypeSmall organic molecule
Emp. Form.C12H16N2O4
Mol. Mass.252.2664
SMILESC[C@H](NC(=O)[C@@H](N)Cc1ccc(O)cc1)C(O)=O