Reaction Details
TargetSolute carrier family 15 member 2
LigandBDBM50169128
Substrate/Competitorn/a
Meas. Tech.ChEMBL_762551 (CHEMBL1817008)
Ki 23000±n/a nM
Citation Pedretti, ADe Luca, LMarconi, CRegazzoni, LAldini, GVistoli, G Fragmental modeling of hPepT2 and analysis of its binding features by docking studies and pharmacophore mapping. Bioorg Med Chem19:4544-51 (2011) 
 
Solute carrier family 15 member 2
Name:Solute carrier family 15 member 2
Type:PROTEIN
Mol. Mass.:81795.62
Organism:Homo sapiens (Human)
Description:ChEMBL_762551
Residue:729
BDBM50169128
NameBDBM50169128
Synonyms:(S)-1-[(S)-1-((S)-2-Amino-3-methyl-butyryl)-pyrrolidine-2-carbonyl]-pyrrolidine-2-carboxylic acid | CHEMBL190414
TypeSmall organic molecule
Emp. Form.C15H25N3O4
Mol. Mass.311.3767
SMILESCC(C)[C@H](N)C(=O)N1CCC[C@H]1C(=O)N1CCC[C@H]1C(O)=O