Reaction Details
TargetTranscriptional activator protein LuxR
LigandBDBM50350710
Substrate/Competitorn/a
Meas. Tech.ChEMBL_762767 (CHEMBL1816069)
IC50 770±n/a nM
Citation McInnis, CEBlackwell, HE Thiolactone modulators of quorum sensing revealed through library design and screening. Bioorg Med Chem19:4820-8 (2011) 
 
Transcriptional activator protein LuxR
Name:Transcriptional activator protein LuxR
Type:PROTEIN
Mol. Mass.:28563.86
Organism:Vibrio fischeri
Description:ChEMBL_831639
Residue:250
BDBM50350710
NameBDBM50350710
Synonyms:CHEMBL1812087
TypeSmall organic molecule
Emp. Form.C12H12BrNO2S
Mol. Mass.314.198
SMILESBrc1ccc(CC(=O)N[C@H]2CCSC2=O)cc1