Reaction Details
TargetTranscriptional activator protein LuxR
LigandBDBM50350703
Substrate/Competitorn/a
Meas. Tech.ChEMBL_762767 (CHEMBL1816069)
IC50 450±n/a nM
Citation McInnis, CEBlackwell, HE Thiolactone modulators of quorum sensing revealed through library design and screening. Bioorg Med Chem19:4820-8 (2011) 
 
Transcriptional activator protein LuxR
Name:Transcriptional activator protein LuxR
Type:PROTEIN
Mol. Mass.:28563.86
Organism:Vibrio fischeri
Description:ChEMBL_831639
Residue:250
BDBM50350703
NameBDBM50350703
Synonyms:CHEMBL1814828
TypeSmall organic molecule
Emp. Form.C16H27NO3S
Mol. Mass.313.455
SMILESCCCCCCCCCC(=O)CC(=O)N[C@H]1CCSC1=O