Reaction Details
TargetHistone deacetylase 1
LigandBDBM50350833
Substrate/Competitorn/a
Meas. Tech.ChEMBL_763305 (CHEMBL1820399)
IC50 3±n/a nM
Citation Shultz, MDCao, XChen, CHCho, YSDavis, NREckman, JFan, JFekete, AFirestone, BFlynn, JGreen, JGrowney, JDHolmqvist, MHsu, MJansson, DJiang, LKwon, PLiu, GLombardo, FLu, QMajumdar, DMeta, CPerez, LPu, MRamsey, TRemiszewski, SSkolnik, STraebert, MUrban, LUttamsingh, VWang, PWhitebread, SWhitehead, LYan-Neale, YYao, YMZhou, LAtadja, P Optimization of the in vitro cardiac safety of hydroxamate-based histone deacetylase inhibitors. J Med Chem54:4752-72 (2011) 
 
Histone deacetylase 1
Name:Histone deacetylase 1
Type:Enzyme
Mol. Mass.:55090.27
Organism:Homo sapiens (Human)
Description:Q13547
Residue:482
BDBM50350833
NameBDBM50350833
Synonyms:CHEMBL1819275
TypeSmall organic molecule
Emp. Form.C28H30N4O2
Mol. Mass.454.5634
SMILESCC(C)N(CCc1c(nn2ccccc12)-c1ccccc1)Cc1ccc(\C=C\C(=O)NO)cc1