Reaction Details
TargetHistamine H3 receptor
LigandBDBM50352799
Substrate/Competitorn/a
Meas. Tech.ChEMBL_767071 (CHEMBL1826120)
Ki 6±n/a nM
Citation Sundar, BGBailey, TBacon, EAimone, LHuang, ZLyons, JRaddatz, RHudkins, R Amine-constrained pyridazinone histamine H3 receptor antagonists. Bioorg Med Chem Lett21:5543-6 (2011) 
 
Histamine H3 receptor
Name:Histamine H3 receptor
Type:G Protein-Coupled Receptor (GPCR)
Mol. Mass.:48607.98
Organism:Rattus norvegicus (rat)
Description:n/a
Residue:445
BDBM50352799
NameBDBM50352799
Synonyms:CHEMBL1823403
TypeSmall organic molecule
Emp. Form.C21H27N3O2
Mol. Mass.353.458
SMILESCn1nc(ccc1=O)-c1ccc(OC2CCN(CC2)C2CCCC2)cc1