Reaction Details
TargetHistamine H3 receptor
LigandBDBM50353174
Substrate/Competitorn/a
Meas. Tech.ChEMBL_768592 (CHEMBL1832611)
Ki 10±n/a nM
Citation Hudkins, RLAimone, LDBailey, TRBendesky, RJDandu, RRDunn, DGruner, JAJosef, KALin, YGLyons, JMarcy, VRMathiasen, JRSundar, BGTao, MZulli, ALRaddatz, RBacon, ER Identification of pyridazin-3-one derivatives as potent, selective histamine H3 receptor inverse agonists with robust wake activity. Bioorg Med Chem Lett21:5493-7 (2011) 
 
Histamine H3 receptor
Name:Histamine H3 receptor
Type:G Protein-Coupled Receptor (GPCR)
Mol. Mass.:48691.47
Organism:Homo sapiens (Human)
Description:Binding assays were using CHO cells stably expressing hH3R receptors.
Residue:445
BDBM50353174
NameBDBM50353174
Synonyms:CHEMBL1829471
TypeSmall organic molecule
Emp. Form.C23H26N4O2
Mol. Mass.390.4781
SMILESC[C@@H]1CCCN1CCCOc1ccc(cc1)-c1ccc(=O)n(n1)-c1ccccn1