Reaction Details
TargetHistamine H3 receptor
LigandBDBM50353166
Substrate/Competitorn/a
Meas. Tech.ChEMBL_768593 (CHEMBL1832612)
Ki 8.7±n/a nM
Citation Hudkins, RLAimone, LDBailey, TRBendesky, RJDandu, RRDunn, DGruner, JAJosef, KALin, YGLyons, JMarcy, VRMathiasen, JRSundar, BGTao, MZulli, ALRaddatz, RBacon, ER Identification of pyridazin-3-one derivatives as potent, selective histamine H3 receptor inverse agonists with robust wake activity. Bioorg Med Chem Lett21:5493-7 (2011) 
 
Histamine H3 receptor
Name:Histamine H3 receptor
Type:G Protein-Coupled Receptor (GPCR)
Mol. Mass.:48607.98
Organism:Rattus norvegicus (rat)
Description:n/a
Residue:445
BDBM50353166
NameBDBM50353166
Synonyms:CHEMBL1829473
TypeSmall organic molecule
Emp. Form.C19H25N3O2
Mol. Mass.327.4207
SMILESC[C@@H]1CCCN1CCCOc1ccc(cc1)-c1cc(C)c(=O)[nH]n1