Reaction Details
TargetAurora kinase A
LigandBDBM50353277
Substrate/Competitorn/a
Meas. Tech.ChEMBL_768713 (CHEMBL1831496)
IC50 9238±n/a nM
Citation Shaaban, MRSaleh, TSMayhoub, ASFarag, AM Single step synthesis of new fused pyrimidine derivatives and their evaluation as potent Aurora-A kinase inhibitors. Eur J Med Chem46:3690-5 (2011) 
 
Aurora kinase A
Name:Aurora kinase A
Type:Serine/threonine-protein kinase
Mol. Mass.:45830.98
Organism:Homo sapiens (Human)
Description:O14965
Residue:403
BDBM50353277
NameBDBM50353277
Synonyms:CHEMBL1830681
TypeSmall organic molecule
Emp. Form.C17H11ClN4O2S
Mol. Mass.370.813
SMILESClc1ccc(cc1)-c1c(cnc2ncnn12)S(=O)(=O)c1ccccc1