Reaction Details
TargetSigma non-opioid intracellular receptor 1
LigandBDBM50353281
Substrate/Competitorn/a
Meas. Tech.ChEMBL_768720 (CHEMBL1831503)
Ki 45.5±n/a nM
Citation Abate, CFerorelli, SContino, MMarottoli, RColabufo, NAPerrone, RBerardi, F Arylamides hybrids of two high-affinitys2 receptor ligands as tools for the development of PET radiotracers. Eur J Med Chem46:4733-41 (2011) 
 
Sigma non-opioid intracellular receptor 1
Name:Sigma non-opioid intracellular receptor 1
Type:Protein
Mol. Mass.:25307.17
Organism:Cavia porcellus (Guinea pig)
Description:Q60492
Residue:223
BDBM50353281
NameBDBM50353281
Synonyms:CHEMBL1830685
TypeSmall organic molecule
Emp. Form.C22H35N3O2
Mol. Mass.373.5322
SMILESCOc1ccc(C)cc1C(=O)NCCCN1CCN(CC1)C1CCCCC1