Reaction Details
TargetSigma non-opioid intracellular receptor 1
LigandBDBM50353610
Substrate/Competitorn/a
Meas. Tech.ChEMBL_769558 (CHEMBL1833395)
Ki 3.2±n/a nM
Citation Schläger, TSchepmann, DLehmkuhl, KHolenz, JVela, JMBuschmann, HWünsch, B Combination of two pharmacophoric systems: synthesis and pharmacological evaluation of spirocyclic pyranopyrazoles with highs1 receptor affinity. J Med Chem54:6704-13 (2011) 
 
Sigma non-opioid intracellular receptor 1
Name:Sigma non-opioid intracellular receptor 1
Type:Protein
Mol. Mass.:25307.17
Organism:Cavia porcellus (Guinea pig)
Description:Q60492
Residue:223
BDBM50353610
NameBDBM50353610
Synonyms:CHEMBL1829572
TypeSmall organic molecule
Emp. Form.C26H31N3O2
Mol. Mass.417.5432
SMILESCOC1Cc2c(cnn2-c2ccccc2)C2(CCN(CCCc3ccccc3)CC2)O1