Reaction Details
TargetSigma non-opioid intracellular receptor 1
LigandBDBM50353614
Substrate/Competitorn/a
Meas. Tech.ChEMBL_769558 (CHEMBL1833395)
Ki 0.82±n/a nM
Citation Schläger, TSchepmann, DLehmkuhl, KHolenz, JVela, JMBuschmann, HWünsch, B Combination of two pharmacophoric systems: synthesis and pharmacological evaluation of spirocyclic pyranopyrazoles with highs1 receptor affinity. J Med Chem54:6704-13 (2011) 
 
Sigma non-opioid intracellular receptor 1
Name:Sigma non-opioid intracellular receptor 1
Type:Protein
Mol. Mass.:25307.17
Organism:Cavia porcellus (Guinea pig)
Description:Q60492
Residue:223
BDBM50353614
NameBDBM50353614
Synonyms:CHEMBL1829579
TypeSmall organic molecule
Emp. Form.C22H31N3O2
Mol. Mass.369.5004
SMILESCCCCCN1CCC2(CC1)OC(Cc1c2cnn1-c1ccccc1)OC