Reaction Details
TargetSigma non-opioid intracellular receptor 1
LigandBDBM50353616
Substrate/Competitorn/a
Meas. Tech.ChEMBL_769558 (CHEMBL1833395)
Ki 1.6±n/a nM
Citation Schläger, TSchepmann, DLehmkuhl, KHolenz, JVela, JMBuschmann, HWünsch, B Combination of two pharmacophoric systems: synthesis and pharmacological evaluation of spirocyclic pyranopyrazoles with highs1 receptor affinity. J Med Chem54:6704-13 (2011) 
 
Sigma non-opioid intracellular receptor 1
Name:Sigma non-opioid intracellular receptor 1
Type:Protein
Mol. Mass.:25307.17
Organism:Cavia porcellus (Guinea pig)
Description:Q60492
Residue:223
BDBM50353616
NameBDBM50353616
Synonyms:CHEMBL1829581
TypeSmall organic molecule
Emp. Form.C22H29N3O2
Mol. Mass.367.4846
SMILESCOC1Cc2c(cnn2-c2ccccc2)C2(CCN(CCC(C)=C)CC2)O1