Reaction Details
TargetSigma non-opioid intracellular receptor 1
LigandBDBM50321782
Substrate/Competitorn/a
Meas. Tech.ChEMBL_769558 (CHEMBL1833395)
Ki 0.43±n/a nM
Citation Schläger, TSchepmann, DLehmkuhl, KHolenz, JVela, JMBuschmann, HWünsch, B Combination of two pharmacophoric systems: synthesis and pharmacological evaluation of spirocyclic pyranopyrazoles with highs1 receptor affinity. J Med Chem54:6704-13 (2011) 
 
Sigma non-opioid intracellular receptor 1
Name:Sigma non-opioid intracellular receptor 1
Type:Protein
Mol. Mass.:25307.17
Organism:Cavia porcellus (Guinea pig)
Description:Q60492
Residue:223
BDBM50321782
NameBDBM50321782
Synonyms:1-(cyclohexylmethyl)-1'-phenyl-6',7'-dihydro-1'H-spiro[piperidine-4,4'-pyrano[4,3-c]pyrazole] | CHEMBL1171555
TypeSmall organic molecule
Emp. Form.C23H31N3O
Mol. Mass.365.5117
SMILESC(C1CCCCC1)N1CCC2(CC1)OCCc1c2cnn1-c1ccccc1