Reaction Details
TargetSigma non-opioid intracellular receptor 1
LigandBDBM50353625
Substrate/Competitorn/a
Meas. Tech.ChEMBL_769558 (CHEMBL1833395)
Ki 0.98±n/a nM
Citation Schläger, TSchepmann, DLehmkuhl, KHolenz, JVela, JMBuschmann, HWünsch, B Combination of two pharmacophoric systems: synthesis and pharmacological evaluation of spirocyclic pyranopyrazoles with highs1 receptor affinity. J Med Chem54:6704-13 (2011) 
 
Sigma non-opioid intracellular receptor 1
Name:Sigma non-opioid intracellular receptor 1
Type:Protein
Mol. Mass.:25307.17
Organism:Cavia porcellus (Guinea pig)
Description:Q60492
Residue:223
BDBM50353625
NameBDBM50353625
Synonyms:CHEMBL1829670
TypeSmall organic molecule
Emp. Form.C21H29N3O
Mol. Mass.339.4745
SMILESCC(C)CCN1CCC2(CC1)OCCc1c2cnn1-c1ccccc1