Reaction Details
TargetHistamine H3 receptor
LigandBDBM50355138
Substrate/Competitorn/a
Meas. Tech.ChEMBL_772497 (CHEMBL1839389)
Ki 1.8±n/a nM
Citation Tao, MRaddatz, RAimone, LDHudkins, RL Synthesis and structure-activity relationships of 4,5-fused pyridazinones as histamine H3 receptor antagonists. Bioorg Med Chem Lett21:6126-30 (2011) 
 
Histamine H3 receptor
Name:Histamine H3 receptor
Type:G Protein-Coupled Receptor (GPCR)
Mol. Mass.:48607.98
Organism:Rattus norvegicus (rat)
Description:n/a
Residue:445
BDBM50355138
NameBDBM50355138
Synonyms:CHEMBL1835708
TypeSmall organic molecule
Emp. Form.C24H29N3O2
Mol. Mass.391.506
SMILESCn1nc(-c2ccc(OCCCN3CCCCCC3)cc2)c2ccccc2c1=O