Reaction Details
TargetHistamine H3 receptor
LigandBDBM50355141
Substrate/Competitorn/a
Meas. Tech.ChEMBL_772494 (CHEMBL1839285)
Ki 0.8±n/a nM
Citation Tao, MRaddatz, RAimone, LDHudkins, RL Synthesis and structure-activity relationships of 4,5-fused pyridazinones as histamine H3 receptor antagonists. Bioorg Med Chem Lett21:6126-30 (2011) 
 
Histamine H3 receptor
Name:Histamine H3 receptor
Type:G Protein-Coupled Receptor (GPCR)
Mol. Mass.:48691.47
Organism:Homo sapiens (Human)
Description:Binding assays were using CHO cells stably expressing hH3R receptors.
Residue:445
BDBM50355141
NameBDBM50355141
Synonyms:CHEMBL1835704
TypeSmall organic molecule
Emp. Form.C23H27N3O2
Mol. Mass.377.4794
SMILESC[C@@H]1CCCN1CCCOc1ccc(cc1)-c1nn(C)c(=O)c2ccccc12