Reaction Details
TargetDNA polymerase beta
LigandBDBM50356642
Substrate/Competitorn/a
Meas. Tech.ChEMBL_785333 (CHEMBL1921601)
IC50 7600±n/a nM
Citation Maruo, SKuriyama, IKuramochi, KTsubaki, KYoshida, HMizushina, Y Inhibitory effect of novel 5-O-acyl juglones on mammalian DNA polymerase activity, cancer cell growth and inflammatory response. Bioorg Med Chem19:5803-12 (2011) 
 
DNA polymerase beta
Name:DNA polymerase beta
Type:PROTEIN
Mol. Mass.:38334.34
Organism:Rattus norvegicus
Description:ChEMBL_1361926
Residue:335
BDBM50356642
NameBDBM50356642
Synonyms:CHEMBL1917196
TypeSmall organic molecule
Emp. Form.C22H28O4
Mol. Mass.356.4553
SMILESCCCCCCCCCCCC(=O)Oc1cccc2C(=O)C=CC(=O)c12