Reaction Details
TargetDNA nucleotidylexotransferase
LigandBDBM50356642
Substrate/Competitorn/a
Meas. Tech.ChEMBL_785409 (CHEMBL1919788)
IC50 8400±n/a nM
Citation Maruo, SKuriyama, IKuramochi, KTsubaki, KYoshida, HMizushina, Y Inhibitory effect of novel 5-O-acyl juglones on mammalian DNA polymerase activity, cancer cell growth and inflammatory response. Bioorg Med Chem19:5803-12 (2011) 
 
DNA nucleotidylexotransferase
Name:DNA nucleotidylexotransferase
Type:PROTEIN
Mol. Mass.:58304.95
Organism:Bos taurus
Description:ChEMBL_1297318
Residue:509
BDBM50356642
NameBDBM50356642
Synonyms:CHEMBL1917196
TypeSmall organic molecule
Emp. Form.C22H28O4
Mol. Mass.356.4553
SMILESCCCCCCCCCCCC(=O)Oc1cccc2C(=O)C=CC(=O)c12