Reaction Details
TargetHistone deacetylase 8
LigandBDBM50379129
Substrate/Competitorn/a
Meas. Tech.ChEMBL_809836 (CHEMBL2014773)
IC50 15±n/a nM
Citation Hutt, DMOlsen, CAVickers, CJHerman, DChalfant, MMontero, ALeman, LJBurkle, RMaryanoff, BEBalch, WEGhadiri, MR Potential Agents for Treating Cystic Fibrosis: Cyclic Tetrapeptides that Restore Trafficking and Activity of ¿F508-CFTR. ACS Med Chem Lett2:703-707 (2011) 
 
Histone deacetylase 8
Name:Histone deacetylase 8
Type:Enzyme
Mol. Mass.:41749.60
Organism:Homo sapiens (Human)
Description:Q9BY41
Residue:377
BDBM50379129
NameBDBM50379129
Synonyms:CHEMBL2012814
TypeSmall organic molecule
Emp. Form.C33H47N5O5
Mol. Mass.593.7568
SMILESCCC(=O)CCCCC[C@@H]1NC(=O)[C@@H]2CCCN2C(=O)C[C@H](CC(C)C)NC(=O)[C@H](Cc2c[nH]c3ccccc23)NC1=O