Reaction Details
TargetHistone deacetylase 8
LigandBDBM50302052
Substrate/Competitorn/a
Meas. Tech.ChEMBL_809836 (CHEMBL2014773)
IC50 130±n/a nM
Citation Hutt, DMOlsen, CAVickers, CJHerman, DChalfant, MMontero, ALeman, LJBurkle, RMaryanoff, BEBalch, WEGhadiri, MR Potential Agents for Treating Cystic Fibrosis: Cyclic Tetrapeptides that Restore Trafficking and Activity of ¿F508-CFTR. ACS Med Chem Lett2:703-707 (2011) 
 
Histone deacetylase 8
Name:Histone deacetylase 8
Type:Enzyme
Mol. Mass.:41749.60
Organism:Homo sapiens (Human)
Description:Q9BY41
Residue:377
BDBM50302052
NameBDBM50302052
Synonyms:6-((2S,5S,8S,11S)-8-((1H-indol-3-yl)methyl)-11-isobutyl-2-methyl-3,6,9,13-tetraoxo-1,4,7,10-tetraazacyclotridecan-5-yl)-N-hydroxyhexanamide | CHEMBL585939
TypeSmall organic molecule
Emp. Form.C29H42N6O6
Mol. Mass.570.6804
SMILESCC(C)C[C@H]1CC(=O)N[C@@H](C)C(=O)N[C@@H](CCCCCC(=O)NO)C(=O)N[C@@H](Cc2c[nH]c3ccccc23)C(=O)N1