Reaction Details
TargetHistone deacetylase 1
LigandBDBM50379135
Substrate/Competitorn/a
Meas. Tech.ChEMBL_812542 (CHEMBL2014417)
IC50 25±n/a nM
Citation Hutt, DMOlsen, CAVickers, CJHerman, DChalfant, MMontero, ALeman, LJBurkle, RMaryanoff, BEBalch, WEGhadiri, MR Potential Agents for Treating Cystic Fibrosis: Cyclic Tetrapeptides that Restore Trafficking and Activity of ¿F508-CFTR. ACS Med Chem Lett2:703-707 (2011) 
 
Histone deacetylase 1
Name:Histone deacetylase 1
Type:Enzyme
Mol. Mass.:55090.27
Organism:Homo sapiens (Human)
Description:Q13547
Residue:482
BDBM50379135
NameBDBM50379135
Synonyms:CHEMBL2012818
TypeSmall organic molecule
Emp. Form.C31H43N7O4
Mol. Mass.577.7176
SMILESCC[C@H](C)[C@@H]1NC(=O)[C@H](Cc2c[nH]c3ccccc23)NC(=O)[C@H](CCCCCC(=O)CC)NC(=O)[C@@H](C)n2cc1nn2