Reaction Details
TargetHistone deacetylase 3/Nuclear receptor corepressor 2 (HDAC3/NCoR2)
LigandBDBM50302077
Substrate/Competitorn/a
Meas. Tech.ChEMBL_809834 (CHEMBL2014771)
IC50 140±n/a nM
Citation Hutt, DMOlsen, CAVickers, CJHerman, DChalfant, MMontero, ALeman, LJBurkle, RMaryanoff, BEBalch, WEGhadiri, MR Potential Agents for Treating Cystic Fibrosis: Cyclic Tetrapeptides that Restore Trafficking and Activity of ¿F508-CFTR. ACS Med Chem Lett2:703-707 (2011) 
 
Histone deacetylase 3/Nuclear receptor corepressor 2 (HDAC3/NCoR2)
Name:Histone deacetylase 3/Nuclear receptor corepressor 2 (HDAC3/NCoR2)
Type:n/a
Mol. Mass.:n/a
Description:ASSAY_ID of ChEMBL is 2146499
Components:This complex has 2 components.
Component 1
Name:Histone deacetylase 3
Synonyms:HD3 HDAC3_HUMAN Human HDAC3 SMAP45
Type:Enzyme
Mol. Mass.:48829.55
Organism:Homo sapiens (Human)
Description:O15379
Residue:428
Component 2
Name:Nuclear receptor corepressor 2
Synonyms:CTG repeat protein 26 Histone deacetylase 2/Nuclear receptor corepressor 2 NCOR2 Nuclear receptor corepressor 2 SMAP270 Silencing mediator of retinoic acid and thyroid hormone receptor TRAC | Thyroid-, retinoic-acid-receptor-associated corepressor
Type:Enzyme
Mol. Mass.:274839.59
Organism:Homo sapiens (Human)
Description:Q9Y618
Residue:2514
BDBM50302077
NameBDBM50302077
Synonyms:(3S,6S,9S,13S)-3-((1H-indol-3-yl)methyl)-13-isobutyl-9-methyl-6-(6-oxooctyl)-1,4,7,10-tetraazacyclotridecane-2,5,8,11-tetraone | CHEMBL583130
TypeSmall organic molecule
Emp. Form.C31H45N5O5
Mol. Mass.567.7195
SMILESCCC(=O)CCCCC[C@@H]1NC(=O)[C@H](C)NC(=O)C[C@H](CC(C)C)NC(=O)[C@H](Cc2c[nH]c3ccccc23)NC1=O