Reaction Details
TargetPotassium voltage-gated channel subfamily H member 2
LigandBDBM50379170
Substrate/Competitorn/a
Meas. Tech.ChEMBL_810399 (CHEMBL2014817)
IC50 1300±n/a nM
Citation Brocklehurst, KJBroo, AButlin, RJBrown, HSClarke, DSDavidsson, ÖGoldberg, KGroombridge, SDKelly, EELeach, AMcKerrecher, DO'Donnell, CPoucher, SSchofield, PScott, JSTeague, JWestgate, LWood, MJ Discovery, optimisation and in vivo evaluation of novel GPR119 agonists. Bioorg Med Chem Lett21:7310-6 (2011) 
 
Potassium voltage-gated channel subfamily H member 2
Name:Potassium voltage-gated channel subfamily H member 2
Type:Multi-pass membrane protein
Mol. Mass.:126672.65
Organism:Homo sapiens (Human)
Description:Q12809
Residue:1159
BDBM50379170
NameBDBM50379170
Synonyms:CHEMBL2010842
TypeSmall organic molecule
Emp. Form.C23H24FN7OS
Mol. Mass.465.546
SMILESCN(C1CCN(Cc2nc3cc(F)ccc3s2)CC1)C(=O)Cc1ccc(cc1)-n1cnnn1