Reaction Details
TargetPotassium voltage-gated channel subfamily H member 2
LigandBDBM50379172
Substrate/Competitorn/a
Meas. Tech.ChEMBL_810399 (CHEMBL2014817)
IC50 2800±n/a nM
Citation Brocklehurst, KJBroo, AButlin, RJBrown, HSClarke, DSDavidsson, ÖGoldberg, KGroombridge, SDKelly, EELeach, AMcKerrecher, DO'Donnell, CPoucher, SSchofield, PScott, JSTeague, JWestgate, LWood, MJ Discovery, optimisation and in vivo evaluation of novel GPR119 agonists. Bioorg Med Chem Lett21:7310-6 (2011) 
 
Potassium voltage-gated channel subfamily H member 2
Name:Potassium voltage-gated channel subfamily H member 2
Type:Multi-pass membrane protein
Mol. Mass.:126672.65
Organism:Homo sapiens (Human)
Description:Q12809
Residue:1159
BDBM50379172
NameBDBM50379172
Synonyms:CHEMBL2010840
TypeSmall organic molecule
Emp. Form.C23H24F4N6O
Mol. Mass.476.4699
SMILESCN(C1CCN(Cc2ccc(c(F)c2)C(F)(F)F)CC1)C(=O)Cc1ccc(cc1)-n1cnnn1