Reaction Details
TargetPotassium voltage-gated channel subfamily H member 2
LigandBDBM50379161
Substrate/Competitorn/a
Meas. Tech.ChEMBL_810399 (CHEMBL2014817)
IC50 4200±n/a nM
Citation Brocklehurst, KJBroo, AButlin, RJBrown, HSClarke, DSDavidsson, ÖGoldberg, KGroombridge, SDKelly, EELeach, AMcKerrecher, DO'Donnell, CPoucher, SSchofield, PScott, JSTeague, JWestgate, LWood, MJ Discovery, optimisation and in vivo evaluation of novel GPR119 agonists. Bioorg Med Chem Lett21:7310-6 (2011) 
 
Potassium voltage-gated channel subfamily H member 2
Name:Potassium voltage-gated channel subfamily H member 2
Type:Multi-pass membrane protein
Mol. Mass.:126672.65
Organism:Homo sapiens (Human)
Description:Q12809
Residue:1159
BDBM50379161
NameBDBM50379161
Synonyms:CHEMBL2010851
TypeSmall organic molecule
Emp. Form.C23H26F4N2O3S
Mol. Mass.486.523
SMILESCN([C@@H]1CCN(Cc2ccc(cc2)C(F)(F)F)C[C@@H]1F)C(=O)Cc1ccc(cc1)S(C)(=O)=O