Reaction Details
TargetAngiopoietin-1 receptor
LigandBDBM50379194
Substrate/Competitorn/a
Meas. Tech.ChEMBL_810622 (CHEMBL2015673)
IC50 10±n/a nM
Citation Hudkins, RLBecknell, NCZulli, ALUnderiner, TLAngeles, TSAimone, LDAlbom, MSChang, HMiknyoczki, SJHunter, KJones-Bolin, SZhao, HBacon, ERMallamo, JPAtor, MARuggeri, BA Synthesis and biological profile of the pan-vascular endothelial growth factor receptor/tyrosine kinase with immunoglobulin and epidermal growth factor-like homology domains 2 (VEGF-R/TIE-2) inhibitor 11-(2-methylpropyl)-12,13-dihydro-2-methyl-8-(pyrimidin-2-ylamino)-4H-indazolo[5,4-a]pyrrolo[3,4-c J Med Chem55:903-13 (2012) 
 
Angiopoietin-1 receptor
Name:Angiopoietin-1 receptor
Type:Enzyme
Mol. Mass.:125835.70
Organism:Homo sapiens (Human)
Description:Q02763
Residue:1124
BDBM50379194
NameBDBM50379194
Synonyms:CHEMBL2010873
TypeSmall organic molecule
Emp. Form.C30H31N7O
Mol. Mass.505.6134
SMILESCCc1cnc(Nc2ccc3n(CC(C)C)c4c5CCc6nn(C)cc6-c5c5C(=O)NCc5c4c3c2)nc1