Reaction Details
TargetVascular endothelial growth factor receptor 2
LigandBDBM50379189
Substrate/Competitorn/a
Meas. Tech.ChEMBL_810621 (CHEMBL2015672)
IC50>3000±n/a nM
Citation Hudkins, RLBecknell, NCZulli, ALUnderiner, TLAngeles, TSAimone, LDAlbom, MSChang, HMiknyoczki, SJHunter, KJones-Bolin, SZhao, HBacon, ERMallamo, JPAtor, MARuggeri, BA Synthesis and biological profile of the pan-vascular endothelial growth factor receptor/tyrosine kinase with immunoglobulin and epidermal growth factor-like homology domains 2 (VEGF-R/TIE-2) inhibitor 11-(2-methylpropyl)-12,13-dihydro-2-methyl-8-(pyrimidin-2-ylamino)-4H-indazolo[5,4-a]pyrrolo[3,4-c J Med Chem55:903-13 (2012) 
 
Vascular endothelial growth factor receptor 2
Name:Vascular endothelial growth factor receptor 2
Type:Receptor Tyrosine Kinase
Mol. Mass.:151510.97
Organism:Homo sapiens (Human)
Description:P35968
Residue:1356
BDBM50379189
NameBDBM50379189
Synonyms:CHEMBL2010874
TypeSmall organic molecule
Emp. Form.C30H31N7O
Mol. Mass.505.6134
SMILESCC(C)Cn1c2ccc(Nc3nc(C)cc(C)n3)cc2c2c3CNC(=O)c3c3-c4cn(C)nc4CCc3c12