Reaction Details
TargetFibroblast growth factor receptor 1
LigandBDBM50379186
Substrate/Competitorn/a
Meas. Tech.ChEMBL_810791 (CHEMBL2016110)
IC50 13±n/a nM
Citation Hudkins, RLBecknell, NCZulli, ALUnderiner, TLAngeles, TSAimone, LDAlbom, MSChang, HMiknyoczki, SJHunter, KJones-Bolin, SZhao, HBacon, ERMallamo, JPAtor, MARuggeri, BA Synthesis and biological profile of the pan-vascular endothelial growth factor receptor/tyrosine kinase with immunoglobulin and epidermal growth factor-like homology domains 2 (VEGF-R/TIE-2) inhibitor 11-(2-methylpropyl)-12,13-dihydro-2-methyl-8-(pyrimidin-2-ylamino)-4H-indazolo[5,4-a]pyrrolo[3,4-c J Med Chem55:903-13 (2012) 
 
Fibroblast growth factor receptor 1
Name:Fibroblast growth factor receptor 1
Type:Receptor
Mol. Mass.:91861.70
Organism:Homo sapiens (Human)
Description:P11362
Residue:822
BDBM50379186
NameBDBM50379186
Synonyms:CEP-11981 | CHEMBL2010872
TypeSmall organic molecule
Emp. Form.C28H27N7O
Mol. Mass.477.5603
SMILESCC(C)Cn1c2ccc(Nc3ncccn3)cc2c2c3CNC(=O)c3c3-c4cn(C)nc4CCc3c12