Reaction Details
TargetMultidrug resistance-associated protein 1
LigandBDBM50305083
Substrate/Competitorn/a
Meas. Tech.ChEMBL_811069 (CHEMBL2014649)
IC50 2000±n/a nM
Citation Valdameri, GGenoux-Bastide, EPeres, BGauthier, CGuitton, JTerreux, RWinnischofer, SMRocha, MEBoumendjel, ADi Pietro, A Substituted chromones as highly potent nontoxic inhibitors, specific for the breast cancer resistance protein. J Med Chem55:966-70 (2012) 
 
Multidrug resistance-associated protein 1
Name:Multidrug resistance-associated protein 1
Type:n/a
Mol. Mass.:171597.72
Organism:Homo sapiens (Human)
Description:P33527
Residue:1531
BDBM50305083
NameBDBM50305083
Synonyms:3-((3S,6S)-6-Isobutyl-9-methoxy-1,4-dioxo-1,2,3,4,6,7,12,12a-octahydro-pyrazino[1',2':1,6]pyrido[3,4-b]indol-3-yl)-propionic acid tert-butyl ester CHEMBL488910 Ko143 | US9695174, Ko143
TypeSmall organic molecule
Emp. Form.C26H35N3O5
Mol. Mass.469.5732
SMILESCOc1ccc2c3C[C@@H]4N([C@@H](CC(C)C)c3[nH]c2c1)C(=O)[C@H](CCC(=O)OC(C)(C)C)NC4=O