Reaction Details
TargetTranscriptional regulator ERG
LigandBDBM50379275
Substrate/Competitorn/a
Meas. Tech.ChEMBL_811271 (CHEMBL2015223)
Kd 11700±n/a nM
Citation Kemp, MMWeïwer, MKoehler, AN Unbiased binding assays for discovering small-molecule probes and drugs. Bioorg Med Chem20:1979-89 (2012) 
 
Transcriptional regulator ERG
Name:Transcriptional regulator ERG
Type:PROTEIN
Mol. Mass.:54615.84
Organism:Homo sapiens (Human)
Description:ChEMBL_1335569
Residue:486
BDBM50379275
NameBDBM50379275
Synonyms:CHEMBL2011500
TypeSmall organic molecule
Emp. Form.C17H13Cl2NO4
Mol. Mass.366.195
SMILESCOc1ccc(cc1)C(=O)CC1(O)C(=O)Nc2c1c(Cl)ccc2Cl