Reaction Details
TargetAldo-keto reductase family 1 member B1
LigandBDBM50056908
Substrate/Competitorn/a
Meas. Tech.ChEMBL_811405 (CHEMBL2013617)
IC50 2300±n/a nM
Citation Lee, JLee, YMLee, BWKim, JHKim, JS Chemical constituents from the aerial parts of Aster koraiensis with protein glycation and aldose reductase inhibitory activities. J Nat Prod75:267-70 (2012) 
 
Aldo-keto reductase family 1 member B1
Name:Aldo-keto reductase family 1 member B1
Type:PROTEIN
Mol. Mass.:35797.87
Organism:Rattus norvegicus
Description:ChEMBL_1512484
Residue:316
BDBM50056908
NameBDBM50056908
Synonyms:(1R,3R,4S,5R)-3,4-Bis-[(E)-3-(3,4-dihydroxy-phenyl)-acryloyloxy]-1,5-dihydroxy-cyclohexanecarboxylic acid 3,4-di-O-caffeoylquinicacid CHEMBL177126 | NSC-649410
TypeSmall organic molecule
Emp. Form.C25H24O12
Mol. Mass.516.4509
SMILESO[C@@H]1C[C@@](O)(C[C@@H](OC(=O)\C=C\c2ccc(O)c(O)c2)[C@H]1OC(=O)\C=C\c1ccc(O)c(O)c1)C(O)=O