Reaction Details
TargetDNA nucleotidylexotransferase
LigandBDBM50379293
Substrate/Competitorn/a
Meas. Tech.ChEMBL_811413 (CHEMBL2013671)
IC50>200000±n/a nM
Citation Myobatake, YTakeuchi, TKuramochi, KKuriyama, IIshido, THirano, KSugawara, FYoshida, HMizushina, Y Pinophilins A and B, inhibitors of mammalian A-, B-, and Y-family DNA polymerases and human cancer cell proliferation. J Nat Prod75:135-41 (2012) 
 
DNA nucleotidylexotransferase
Name:DNA nucleotidylexotransferase
Type:PROTEIN
Mol. Mass.:58304.95
Organism:Bos taurus
Description:ChEMBL_1297318
Residue:509
BDBM50379293
NameBDBM50379293
Synonyms:CHEMBL2011648
TypeSmall organic molecule
Emp. Form.C21H22O7
Mol. Mass.386.3952
SMILESC\C=C\C1=CC2=CC(=O)[C@@](C)(O)[C@@H](OC(=O)c3c(C)cc(O)cc3O)[C@@H]2CO1