Reaction Details
TargetProtein E6
LigandBDBM26658
Substrate/Competitorn/a
Meas. Tech.ChEMBL_811818 (CHEMBL2014495)
IC50 4000±n/a nM
Citation Yuan, CHFilippova, MTungteakkhun, SSDuerksen-Hughes, PJKrstenansky, JL Small molecule inhibitors of the HPV16-E6 interaction with caspase 8. Bioorg Med Chem Lett22:2125-9 (2012) 
 
Protein E6
Name:Protein E6
Type:PROTEIN
Mol. Mass.:19201.73
Organism:Human papillomavirus type 16
Description:ChEMBL_811818
Residue:158
BDBM26658
NameBDBM26658
Synonyms:2-(2,4-dihydroxyphenyl)-3,5,7-trihydroxy-1-benzopyran-4-one 2-(2,4-dihydroxyphenyl)-3,5,7-trihydroxy-chromone 2-[2,4-bis(oxidanyl)phenyl]-3,5,7-tris(oxidanyl)chromen-4-one MLS000069618 Morin (5) SMR000058259 morin
TypeFlavonoid
Emp. Form.C15H10O7
Mol. Mass.302.2357
SMILESOc1ccc(c(O)c1)-c1oc2cc(O)cc(O)c2c(=O)c1O