Reaction Details
TargetGrowth hormone secretagogue receptor type 1
LigandBDBM50379308
Substrate/Competitorn/a
Meas. Tech.ChEMBL_811974 (CHEMBL2013344)
IC50 8±n/a nM
Citation Mihalic, JTKim, YJLizarzaburu, MChen, XDeignan, JWanska, MYu, MFu, JChen, XZhang, AConnors, RLiang, LLindstrom, MMa, JTang, LDai, KLi, L Discovery of a new class of ghrelin receptor antagonists. Bioorg Med Chem Lett22:2046-51 (2012) 
 
Growth hormone secretagogue receptor type 1
Name:Growth hormone secretagogue receptor type 1
Type:Receptor
Mol. Mass.:41334.57
Organism:Homo sapiens (Human)
Description:Receptor binding studies use plasma membranes from LLC PK-1 cells transiently transfected with hGHSR1a.
Residue:366
BDBM50379308
NameBDBM50379308
Synonyms:CHEMBL2011816
TypeSmall organic molecule
Emp. Form.C32H36N4O4
Mol. Mass.540.6526
SMILESCC(C)[C@@H](N1CC(=O)Nc2ccc(Oc3ccccc3)cc2C1=O)C(=O)NC1CCN(Cc2ccccc2)CC1