Reaction Details
TargetInhibitor of nuclear factor kappa-B kinase subunit epsilon
LigandBDBM50379339
Substrate/Competitorn/a
Meas. Tech.ChEMBL_811984 (CHEMBL2013354)
IC50 4±n/a nM
Citation Wang, TBlock, MACowen, SDavies, AMDevereaux, EGingipalli, LJohannes, JLarsen, NASu, QTucker, JAWhitston, DWu, JZhang, HJZinda, MChuaqui, C Discovery of azabenzimidazole derivatives as potent, selective inhibitors of TBK1/IKKe kinases. Bioorg Med Chem Lett22:2063-9 (2012) 
 
Inhibitor of nuclear factor kappa-B kinase subunit epsilon
Name:Inhibitor of nuclear factor kappa-B kinase subunit epsilon
Type:Serine/threonine-protein kinase
Mol. Mass.:80475.98
Organism:Homo sapiens (Human)
Description:Kinase inhibitory activity was determined using recombinant human IKK-epsilon expressed in baculovirus as a FLAG-tagged fusion protein.
Residue:716
BDBM50379339
NameBDBM50379339
Synonyms:CHEMBL2011940
TypeSmall organic molecule
Emp. Form.C20H23BrN6O
Mol. Mass.443.34
SMILESNc1cccc(c1)-c1nc2ncc(Br)c(NCCCNC(=O)C3CCC3)c2[nH]1