Reaction Details
TargetSerine/threonine-protein kinase TBK1
LigandBDBM50379357
Substrate/Competitorn/a
Meas. Tech.ChEMBL_811983 (CHEMBL2013353)
EC50 6±n/a nM
Citation Wang, TBlock, MACowen, SDavies, AMDevereaux, EGingipalli, LJohannes, JLarsen, NASu, QTucker, JAWhitston, DWu, JZhang, HJZinda, MChuaqui, C Discovery of azabenzimidazole derivatives as potent, selective inhibitors of TBK1/IKKe kinases. Bioorg Med Chem Lett22:2063-9 (2012) 
 
Serine/threonine-protein kinase TBK1
Name:Serine/threonine-protein kinase TBK1
Type:protein
Mol. Mass.:83645.20
Organism:Homo sapiens (Human)
Description:Q9UHD2
Residue:729
BDBM50379357
NameBDBM50379357
Synonyms:CHEMBL2011933
TypeSmall organic molecule
Emp. Form.C21H24BrN5O2
Mol. Mass.458.352
SMILESCOc1ccc(cc1)-c1nc2ncc(Br)c(NCCCNC(=O)C3CCC3)c2[nH]1