Reaction Details
TargetPotassium voltage-gated channel subfamily H member 2
LigandBDBM50379413
Substrate/Competitorn/a
Meas. Tech.ChEMBL_811993 (CHEMBL2013363)
Ki 1400±n/a nM
Citation Bregman, HNguyen, HNFeric, ELigutti, JLiu, DMcDermott, JSWilenkin, BZou, AHuang, LLi, XMcDonough, SIDimauro, EF The discovery of aminopyrazines as novel, potent Na(v)1.7 antagonists: hit-to-lead identification and SAR. Bioorg Med Chem Lett22:2033-42 (2012) 
 
Potassium voltage-gated channel subfamily H member 2
Name:Potassium voltage-gated channel subfamily H member 2
Type:Multi-pass membrane protein
Mol. Mass.:126672.65
Organism:Homo sapiens (Human)
Description:Q12809
Residue:1159
BDBM50379413
NameBDBM50379413
Synonyms:CHEMBL2012027
TypeSmall organic molecule
Emp. Form.C16H13ClN4O
Mol. Mass.312.754
SMILESNc1ccnc(Nc2ccc(Oc3ccccc3Cl)cc2)n1