Reaction Details
TargetPotassium voltage-gated channel subfamily H member 2
LigandBDBM50379451
Substrate/Competitorn/a
Meas. Tech.ChEMBL_812135 (CHEMBL2013639)
Ki 3200±n/a nM
Citation Chakka, NBregman, HDu, BNguyen, HNBuchanan, JLFeric, ELigutti, JLiu, DMcDermott, JSZou, AMcDonough, SIDimauro, EF Discovery and hit-to-lead optimization of pyrrolopyrimidines as potent, state-dependent Na(v)1.7 antagonists. Bioorg Med Chem Lett22:2052-62 (2012) 
 
Potassium voltage-gated channel subfamily H member 2
Name:Potassium voltage-gated channel subfamily H member 2
Type:Multi-pass membrane protein
Mol. Mass.:126672.65
Organism:Homo sapiens (Human)
Description:Q12809
Residue:1159
BDBM50379451
NameBDBM50379451
Synonyms:CHEMBL2012265
TypeSmall organic molecule
Emp. Form.C23H25N5OS
Mol. Mass.419.543
SMILESCc1ccccc1Cn1ccc2c(OC3CCN(Cc4cscn4)CC3)ncnc12