Reaction Details
TargetPotassium voltage-gated channel subfamily H member 2
LigandBDBM50379452
Substrate/Competitorn/a
Meas. Tech.ChEMBL_812135 (CHEMBL2013639)
Ki 930±n/a nM
Citation Chakka, NBregman, HDu, BNguyen, HNBuchanan, JLFeric, ELigutti, JLiu, DMcDermott, JSZou, AMcDonough, SIDimauro, EF Discovery and hit-to-lead optimization of pyrrolopyrimidines as potent, state-dependent Na(v)1.7 antagonists. Bioorg Med Chem Lett22:2052-62 (2012) 
 
Potassium voltage-gated channel subfamily H member 2
Name:Potassium voltage-gated channel subfamily H member 2
Type:Multi-pass membrane protein
Mol. Mass.:126672.65
Organism:Homo sapiens (Human)
Description:Q12809
Residue:1159
BDBM50379452
NameBDBM50379452
Synonyms:CHEMBL2012266
TypeSmall organic molecule
Emp. Form.C23H25N5OS
Mol. Mass.419.543
SMILESCc1cccc(Cn2ccc3c(OC4CCN(Cc5cscn5)CC4)ncnc23)c1