Reaction Details
TargetPotassium voltage-gated channel subfamily H member 2
LigandBDBM50379439
Substrate/Competitorn/a
Meas. Tech.ChEMBL_812135 (CHEMBL2013639)
Ki 320±n/a nM
Citation Chakka, NBregman, HDu, BNguyen, HNBuchanan, JLFeric, ELigutti, JLiu, DMcDermott, JSZou, AMcDonough, SIDimauro, EF Discovery and hit-to-lead optimization of pyrrolopyrimidines as potent, state-dependent Na(v)1.7 antagonists. Bioorg Med Chem Lett22:2052-62 (2012) 
 
Potassium voltage-gated channel subfamily H member 2
Name:Potassium voltage-gated channel subfamily H member 2
Type:Multi-pass membrane protein
Mol. Mass.:126672.65
Organism:Homo sapiens (Human)
Description:Q12809
Residue:1159
BDBM50379439
NameBDBM50379439
Synonyms:CHEMBL2012301
TypeSmall organic molecule
Emp. Form.C25H23F4N5O
Mol. Mass.485.4766
SMILESFc1c(Cn2ccc3c(OC4CCN(Cc5ccccn5)CC4)ncnc23)cccc1C(F)(F)F