Reaction Details
TargetCyclin-dependent kinase 1
LigandBDBM50379508
Substrate/Competitorn/a
Meas. Tech.ChEMBL_812218 (CHEMBL2013813)
IC50 19±n/a nM
Citation Le Brazidec, JYPasis, ATam, BBoykin, CBlack, CWang, DClaassen, GChong, JHChao, JFan, JNguyen, KSilvian, LLing, LZhang, LChoi, MTeng, MPathan, NZhao, SLi, TTaveras, A Synthesis, SAR and biological evaluation of 1,6-disubstituted-1H-pyrazolo[3,4-d]pyrimidines as dual inhibitors of Aurora kinases and CDK1. Bioorg Med Chem Lett22:2070-4 (2012) 
 
Cyclin-dependent kinase 1
Name:Cyclin-dependent kinase 1
Type:Enzyme Subunit
Mol. Mass.:34101.08
Organism:Homo sapiens (Human)
Description:P06493
Residue:297
BDBM50379508
NameBDBM50379508
Synonyms:CHEMBL2012400
TypeSmall organic molecule
Emp. Form.C19H23N7O
Mol. Mass.365.4322
SMILESCn1cc(Nc2ncc3cnn(C4CCC5(CC5)CC4)c3n2)cc1C(N)=O