Reaction Details
TargetAurora kinase B
LigandBDBM50379496
Substrate/Competitorn/a
Meas. Tech.ChEMBL_812217 (CHEMBL2013812)
IC50 4±n/a nM
Citation Le Brazidec, JYPasis, ATam, BBoykin, CBlack, CWang, DClaassen, GChong, JHChao, JFan, JNguyen, KSilvian, LLing, LZhang, LChoi, MTeng, MPathan, NZhao, SLi, TTaveras, A Synthesis, SAR and biological evaluation of 1,6-disubstituted-1H-pyrazolo[3,4-d]pyrimidines as dual inhibitors of Aurora kinases and CDK1. Bioorg Med Chem Lett22:2070-4 (2012) 
 
Aurora kinase B
Name:Aurora kinase B
Type:Protein
Mol. Mass.:39327.72
Organism:Homo sapiens (Human)
Description:Q96GD4
Residue:344
BDBM50379496
NameBDBM50379496
Synonyms:CHEMBL2012408
TypeSmall organic molecule
Emp. Form.C22H26N8O2
Mol. Mass.434.4942
SMILESCn1cc(Nc2ncc3cnn([C@H]4C[C@@H]5C[C@@H]5C4)c3n2)cc1C(=O)N1CCC[C@H]1C(N)=O