Reaction Details
TargetDual specificity tyrosine-phosphorylation-regulated kinase 2
LigandBDBM50379512
Substrate/Competitorn/a
Meas. Tech.ChEMBL_812378 (CHEMBL2014114)
IC50>10000±n/a nM
Citation Cuny, GDUlyanova, NPPatnaik, DLiu, JFLin, XAuerbach, KRay, SSXian, JGlicksman, MAStein, RLHiggins, JM Structure-activity relationship study of beta-carboline derivatives as haspin kinase inhibitors. Bioorg Med Chem Lett22:2015-9 (2012) 
 
Dual specificity tyrosine-phosphorylation-regulated kinase 2
Name:Dual specificity tyrosine-phosphorylation-regulated kinase 2
Type:PROTEIN
Mol. Mass.:66690.69
Organism:Homo sapiens (Human)
Description:ChEMBL_1508025
Residue:601
BDBM50379512
NameBDBM50379512
Synonyms:CHEMBL2012559
TypeSmall organic molecule
Emp. Form.C17H21N3O
Mol. Mass.283.3681
SMILESCOc1ccc2c(c1)n(CCCCN)c1c(C)nccc21