Reaction Details
TargetSerine/threonine-protein kinase haspin
LigandBDBM50379524
Substrate/Competitorn/a
Meas. Tech.ChEMBL_812377 (CHEMBL2014113)
IC50 460±n/a nM
Citation Cuny, GDUlyanova, NPPatnaik, DLiu, JFLin, XAuerbach, KRay, SSXian, JGlicksman, MAStein, RLHiggins, JM Structure-activity relationship study of beta-carboline derivatives as haspin kinase inhibitors. Bioorg Med Chem Lett22:2015-9 (2012) 
 
Serine/threonine-protein kinase haspin
Name:Serine/threonine-protein kinase haspin
Type:PROTEIN
Mol. Mass.:88531.28
Organism:Homo sapiens (Human)
Description:ChEMBL_1510616
Residue:798
BDBM50379524
NameBDBM50379524
Synonyms:CHEMBL2012561
TypeSmall organic molecule
Emp. Form.C19H25N3O
Mol. Mass.311.4213
SMILESCOc1ccc2c(c1)n(CCCCN)c1c(nccc21)C(C)C